{"text_format":"1","workbook":"xlsx","n_sheets":3,"sheets":["AVALIAÇÃO","PLANO","Formandos"],"not_rendered":{"charts":0,"images":1,"macros":1,"external_links":0,"defined_names":2,"comments":1,"pivot_tables":0},"unopened":[],"bounds":{"document_bytes":16777216,"sheet_cells":100000,"rows_first":2000,"rows_last":500,"rows_between":2000,"halvings":0,"cell_chars":16384,"cell_head_chars":4096},"cells_cut":0,"cells_raw":0,"read":"whole","date_system":"1900"}

{"sheet":"AVALIAÇÃO","index":0,"n_rows":162,"n_cols":13,"rows_kept":162,"cut":false,"hidden":false,"merged":[[5,12,5,14],[5,2,5,11],[4,2,4,11],[12,12,12,21],[7,12,7,14],[11,12,11,23],[9,12,10,12],[9,2,11,2],[9,3,11,3],[9,4,11,4],[9,5,9,9],[9,10,11,10],[9,11,11,11],[8,12,8,17]]}
[]
[null,null,null,null,null,null,null,null,null,null,null,{"$f":"COUNTA(D13:D162)-COUNTBLANK(D13:D162)","v":0}]
[]
[]
[null,null,"Ação:"]
[null,null,null,null,null,null,null,null,null,null,null,null,"◄ Selecione a ação."]
[null,null,null,null,null,null,null,null,null,null,null,"Horas:"]
[null,null,null,null,null,null,null,null,null,null,null,{"$f":"IF(C6=\"AÇÃO…\",\"\",VLOOKUP(C6,PLANO!B4:D74,3,0))","v":{"$error":"#N/A"}},"◄Total de Horas Presenciais."]
[null,null,null,null,null,null,null,null,null,null,null,null,"◄Depois de preenchida, clique em \"COPIAR TABELA\", e cole-a no ponto 6 do relatório."]
[null,null,"N.º","Nome do Formando","N.º de horas de presença","Parâmetros de Avaliação / Ponderações",null,null,null,null,"Av. Quantitativa Final","Menção Qualitativa"]
[null,null,null,null,null,null,null,null,"……….","……….."]
[null,null,null,null,null,"%","%","%",null,null,null,null,"◄ O somatório das ponderações deverá ser igual a 100%! Substitua os colocados a título de exemplo."]
[null,"s",1,{"$f":"IF(ISERROR(VLOOKUP(LEFT($C$6,8)&\".\"&$C13,Formandos!$B$3:$E$2004,4,0))=TRUE,\"\",VLOOKUP(LEFT($C$6,8)&\".\"&$C13,Formandos!$B$3:$E$2004,4,0))","v":""},null,null,null,null,null,null,{"$f":"IF(COUNT(E13:J13)=0,\"\",IF(E13<($L$8/3*2),\"DESISTIU\",IF(COUNT(F13:J13)=0,\"\",ROUND(F13*$F$12+G13*$G$12+H13*$H$12+I13*$I$12+J13*$J$12,1))))","v":""},{"$f":"IF(K13=\"\",\"\",IF(K13=\"DESISTIU\",\"—\",IF(K13>=9,\"Excelente\",IF(K13>=8,\"Muito Bom\",IF(K13>=6.5,\"Bom\",IF(K13>=5,\"Regular\",\"Insuficiente\"))))))","v":""},"◄ As classificações a atribuir em cada um dos parâmetros deverão ser sempre um número inteiro entre 1 e 10."]
[null,"n",2,{"$f":"IF(ISERROR(VLOOKUP(LEFT($C$6,8)&\".\"&$C14,Formandos!$B$3:$E$2004,4,0))=TRUE,\"\",VLOOKUP(LEFT($C$6,8)&\".\"&$C14,Formandos!$B$3:$E$2004,4,0))","v":""},null,null,null,null,null,null,"",{"$f":"IF(K14=\"\",\"\",IF(K14=\"DESISTIU\",\"—\",IF(K14>=9,\"Excelente\",IF(K14>=8,\"Muito Bom\",IF(K14>=6.5,\"Bom\",IF(K14>=5,\"Regular\",\"Insuficiente\"))))))","v":""}]
[null,"s",3,{"$f":"IF(ISERROR(VLOOKUP(LEFT($C$6,8)&\".\"&$C15,Formandos!$B$3:$E$2004,4,0))=TRUE,\"\",VLOOKUP(LEFT($C$6,8)&\".\"&$C15,Formandos!$B$3:$E$2004,4,0))","v":""},null,null,null,null,null,null,"",""]
[null,"n",4,{"$f":"IF(ISERROR(VLOOKUP(LEFT($C$6,8)&\".\"&$C16,Formandos!$B$3:$E$2004,4,0))=TRUE,\"\",VLOOKUP(LEFT($C$6,8)&\".\"&$C16,Formandos!$B$3:$E$2004,4,0))","v":""},null,null,null,null,null,null,"",""]
[null,"s",5,{"$f":"IF(ISERROR(VLOOKUP(LEFT($C$6,8)&\".\"&$C17,Formandos!$B$3:$E$2004,4,0))=TRUE,\"\",VLOOKUP(LEFT($C$6,8)&\".\"&$C17,Formandos!$B$3:$E$2004,4,0))","v":""},null,null,null,null,null,null,"",""]
[null,"n",6,{"$f":"IF(ISERROR(VLOOKUP(LEFT($C$6,8)&\".\"&$C18,Formandos!$B$3:$E$2004,4,0))=TRUE,\"\",VLOOKUP(LEFT($C$6,8)&\".\"&$C18,Formandos!$B$3:$E$2004,4,0))","v":""},null,null,null,null,null,null,"",""]
[null,"s",7,{"$f":"IF(ISERROR(VLOOKUP(LEFT($C$6,8)&\".\"&$C19,Formandos!$B$3:$E$2004,4,0))=TRUE,\"\",VLOOKUP(LEFT($C$6,8)&\".\"&$C19,Formandos!$B$3:$E$2004,4,0))","v":""},null,null,null,null,null,null,"",""]
[null,"n",8,{"$f":"IF(ISERROR(VLOOKUP(LEFT($C$6,8)&\".\"&$C20,Formandos!$B$3:$E$2004,4,0))=TRUE,\"\",VLOOKUP(LEFT($C$6,8)&\".\"&$C20,Formandos!$B$3:$E$2004,4,0))","v":""},null,null,null,null,null,null,"",""]
[null,"s",9,{"$f":"IF(ISERROR(VLOOKUP(LEFT($C$6,8)&\".\"&$C21,Formandos!$B$3:$E$2004,4,0))=TRUE,\"\",VLOOKUP(LEFT($C$6,8)&\".\"&$C21,Formandos!$B$3:$E$2004,4,0))","v":""},null,null,null,null,null,null,"",""]
[null,"n",10,{"$f":"IF(ISERROR(VLOOKUP(LEFT($C$6,8)&\".\"&$C22,Formandos!$B$3:$E$2004,4,0))=TRUE,\"\",VLOOKUP(LEFT($C$6,8)&\".\"&$C22,Formandos!$B$3:$E$2004,4,0))","v":""},null,null,null,null,null,null,"",""]
[null,"s",11,{"$f":"IF(ISERROR(VLOOKUP(LEFT($C$6,8)&\".\"&$C23,Formandos!$B$3:$E$2004,4,0))=TRUE,\"\",VLOOKUP(LEFT($C$6,8)&\".\"&$C23,Formandos!$B$3:$E$2004,4,0))","v":""},null,null,null,null,null,null,"",""]
[null,"n",12,{"$f":"IF(ISERROR(VLOOKUP(LEFT($C$6,8)&\".\"&$C24,Formandos!$B$3:$E$2004,4,0))=TRUE,\"\",VLOOKUP(LEFT($C$6,8)&\".\"&$C24,Formandos!$B$3:$E$2004,4,0))","v":""},null,null,null,null,null,null,"",""]
[null,"s",13,{"$f":"IF(ISERROR(VLOOKUP(LEFT($C$6,8)&\".\"&$C25,Formandos!$B$3:$E$2004,4,0))=TRUE,\"\",VLOOKUP(LEFT($C$6,8)&\".\"&$C25,Formandos!$B$3:$E$2004,4,0))","v":""},null,null,null,null,null,null,"",""]
[null,"n",14,{"$f":"IF(ISERROR(VLOOKUP(LEFT($C$6,8)&\".\"&$C26,Formandos!$B$3:$E$2004,4,0))=TRUE,\"\",VLOOKUP(LEFT($C$6,8)&\".\"&$C26,Formandos!$B$3:$E$2004,4,0))","v":""},null,null,null,null,null,null,"",""]
[null,"s",15,{"$f":"IF(ISERROR(VLOOKUP(LEFT($C$6,8)&\".\"&$C27,Formandos!$B$3:$E$2004,4,0))=TRUE,\"\",VLOOKUP(LEFT($C$6,8)&\".\"&$C27,Formandos!$B$3:$E$2004,4,0))","v":""},null,null,null,null,null,null,"",{"$f":"IF(K27=\"\",\"\",IF(K27=\"DESISTIU\",\"—\",IF(K27>=9,\"Excelente\",IF(K27>=8,\"Muito Bom\",IF(K27>=6.5,\"Bom\",IF(K27>=5,\"Regular\",\"Insuficiente\"))))))","v":""}]
[null,"n",16,{"$f":"IF(ISERROR(VLOOKUP(LEFT($C$6,8)&\".\"&$C28,Formandos!$B$3:$E$2004,4,0))=TRUE,\"\",VLOOKUP(LEFT($C$6,8)&\".\"&$C28,Formandos!$B$3:$E$2004,4,0))","v":""},null,null,null,null,null,null,"",""]
[null,"s",17,{"$f":"IF(ISERROR(VLOOKUP(LEFT($C$6,8)&\".\"&$C29,Formandos!$B$3:$E$2004,4,0))=TRUE,\"\",VLOOKUP(LEFT($C$6,8)&\".\"&$C29,Formandos!$B$3:$E$2004,4,0))","v":""},null,null,null,null,null,null,"",""]
[null,"n",18,{"$f":"IF(ISERROR(VLOOKUP(LEFT($C$6,8)&\".\"&$C30,Formandos!$B$3:$E$2004,4,0))=TRUE,\"\",VLOOKUP(LEFT($C$6,8)&\".\"&$C30,Formandos!$B$3:$E$2004,4,0))","v":""},null,null,null,null,null,null,"",""]
[null,"s",19,{"$f":"IF(ISERROR(VLOOKUP(LEFT($C$6,8)&\".\"&$C31,Formandos!$B$3:$E$2004,4,0))=TRUE,\"\",VLOOKUP(LEFT($C$6,8)&\".\"&$C31,Formandos!$B$3:$E$2004,4,0))","v":""},null,null,null,null,null,null,"",""]
[null,"n",20,{"$f":"IF(ISERROR(VLOOKUP(LEFT($C$6,8)&\".\"&$C32,Formandos!$B$3:$E$2004,4,0))=TRUE,\"\",VLOOKUP(LEFT($C$6,8)&\".\"&$C32,Formandos!$B$3:$E$2004,4,0))","v":""},null,null,null,null,null,null,"",""]
[null,"s",21,{"$f":"IF(ISERROR(VLOOKUP(LEFT($C$6,8)&\".\"&$C33,Formandos!$B$3:$E$2004,4,0))=TRUE,\"\",VLOOKUP(LEFT($C$6,8)&\".\"&$C33,Formandos!$B$3:$E$2004,4,0))","v":""},null,null,null,null,null,null,"",""]
[null,"n",22,{"$f":"IF(ISERROR(VLOOKUP(LEFT($C$6,8)&\".\"&$C34,Formandos!$B$3:$E$2004,4,0))=TRUE,\"\",VLOOKUP(LEFT($C$6,8)&\".\"&$C34,Formandos!$B$3:$E$2004,4,0))","v":""},null,null,null,null,null,null,"",""]
[null,"s",23,{"$f":"IF(ISERROR(VLOOKUP(LEFT($C$6,8)&\".\"&$C35,Formandos!$B$3:$E$2004,4,0))=TRUE,\"\",VLOOKUP(LEFT($C$6,8)&\".\"&$C35,Formandos!$B$3:$E$2004,4,0))","v":""},null,null,null,null,null,null,"",""]
[null,"n",24,{"$f":"IF(ISERROR(VLOOKUP(LEFT($C$6,8)&\".\"&$C36,Formandos!$B$3:$E$2004,4,0))=TRUE,\"\",VLOOKUP(LEFT($C$6,8)&\".\"&$C36,Formandos!$B$3:$E$2004,4,0))","v":""},null,null,null,null,null,null,"",""]
[null,"s",25,{"$f":"IF(ISERROR(VLOOKUP(LEFT($C$6,8)&\".\"&$C37,Formandos!$B$3:$E$2004,4,0))=TRUE,\"\",VLOOKUP(LEFT($C$6,8)&\".\"&$C37,Formandos!$B$3:$E$2004,4,0))","v":""},null,null,null,null,null,null,"",""]
[null,"n",26,{"$f":"IF(ISERROR(VLOOKUP(LEFT($C$6,8)&\".\"&$C38,Formandos!$B$3:$E$2004,4,0))=TRUE,\"\",VLOOKUP(LEFT($C$6,8)&\".\"&$C38,Formandos!$B$3:$E$2004,4,0))","v":""},null,null,null,null,null,null,"",""]
[null,"s",27,{"$f":"IF(ISERROR(VLOOKUP(LEFT($C$6,8)&\".\"&$C39,Formandos!$B$3:$E$2004,4,0))=TRUE,\"\",VLOOKUP(LEFT($C$6,8)&\".\"&$C39,Formandos!$B$3:$E$2004,4,0))","v":""},null,null,null,null,null,null,"",""]
[null,"n",28,{"$f":"IF(ISERROR(VLOOKUP(LEFT($C$6,8)&\".\"&$C40,Formandos!$B$3:$E$2004,4,0))=TRUE,\"\",VLOOKUP(LEFT($C$6,8)&\".\"&$C40,Formandos!$B$3:$E$2004,4,0))","v":""},null,null,null,null,null,null,"",""]
[null,"s",29,{"$f":"IF(ISERROR(VLOOKUP(LEFT($C$6,8)&\".\"&$C41,Formandos!$B$3:$E$2004,4,0))=TRUE,\"\",VLOOKUP(LEFT($C$6,8)&\".\"&$C41,Formandos!$B$3:$E$2004,4,0))","v":""},null,null,null,null,null,null,"",""]
[null,"n",30,{"$f":"IF(ISERROR(VLOOKUP(LEFT($C$6,8)&\".\"&$C42,Formandos!$B$3:$E$2004,4,0))=TRUE,\"\",VLOOKUP(LEFT($C$6,8)&\".\"&$C42,Formandos!$B$3:$E$2004,4,0))","v":""},null,null,null,null,null,null,"",{"$f":"IF(K42=\"\",\"\",IF(K42=\"DESISTIU\",\"—\",IF(K42>=9,\"Excelente\",IF(K42>=8,\"Muito Bom\",IF(K42>=6.5,\"Bom\",IF(K42>=5,\"Regular\",\"Insuficiente\"))))))","v":""}]
[null,"s",31,{"$f":"IF(ISERROR(VLOOKUP(LEFT($C$6,8)&\".\"&$C43,Formandos!$B$3:$E$2004,4,0))=TRUE,\"\",VLOOKUP(LEFT($C$6,8)&\".\"&$C43,Formandos!$B$3:$E$2004,4,0))","v":""},null,null,null,null,null,null,"",""]
[null,"n",32,{"$f":"IF(ISERROR(VLOOKUP(LEFT($C$6,8)&\".\"&$C44,Formandos!$B$3:$E$2004,4,0))=TRUE,\"\",VLOOKUP(LEFT($C$6,8)&\".\"&$C44,Formandos!$B$3:$E$2004,4,0))","v":""},null,null,null,null,null,null,"",""]
[null,"s",33,{"$f":"IF(ISERROR(VLOOKUP(LEFT($C$6,8)&\".\"&$C45,Formandos!$B$3:$E$2004,4,0))=TRUE,\"\",VLOOKUP(LEFT($C$6,8)&\".\"&$C45,Formandos!$B$3:$E$2004,4,0))","v":""},null,null,null,null,null,null,{"$f":"IF(COUNT(E45:J45)=0,\"\",IF(E45<($L$8/3*2),\"DESISTIU\",IF(COUNT(F45:J45)=0,\"\",ROUND(F45*$F$12+G45*$G$12+H45*$H$12+I45*$I$12+J45*$J$12,1))))","v":""},""]
[null,"n",34,{"$f":"IF(ISERROR(VLOOKUP(LEFT($C$6,8)&\".\"&$C46,Formandos!$B$3:$E$2004,4,0))=TRUE,\"\",VLOOKUP(LEFT($C$6,8)&\".\"&$C46,Formandos!$B$3:$E$2004,4,0))","v":""},null,null,null,null,null,null,"",""]
[null,"s",35,{"$f":"IF(ISERROR(VLOOKUP(LEFT($C$6,8)&\".\"&$C47,Formandos!$B$3:$E$2004,4,0))=TRUE,\"\",VLOOKUP(LEFT($C$6,8)&\".\"&$C47,Formandos!$B$3:$E$2004,4,0))","v":""},null,null,null,null,null,null,"",""]
[null,"n",36,{"$f":"IF(ISERROR(VLOOKUP(LEFT($C$6,8)&\".\"&$C48,Formandos!$B$3:$E$2004,4,0))=TRUE,\"\",VLOOKUP(LEFT($C$6,8)&\".\"&$C48,Formandos!$B$3:$E$2004,4,0))","v":""},null,null,null,null,null,null,"",""]
[null,"s",37,{"$f":"IF(ISERROR(VLOOKUP(LEFT($C$6,8)&\".\"&$C49,Formandos!$B$3:$E$2004,4,0))=TRUE,\"\",VLOOKUP(LEFT($C$6,8)&\".\"&$C49,Formandos!$B$3:$E$2004,4,0))","v":""},null,null,null,null,null,null,"",""]
[null,"n",38,{"$f":"IF(ISERROR(VLOOKUP(LEFT($C$6,8)&\".\"&$C50,Formandos!$B$3:$E$2004,4,0))=TRUE,\"\",VLOOKUP(LEFT($C$6,8)&\".\"&$C50,Formandos!$B$3:$E$2004,4,0))","v":""},null,null,null,null,null,null,"",""]
[null,"s",39,{"$f":"IF(ISERROR(VLOOKUP(LEFT($C$6,8)&\".\"&$C51,Formandos!$B$3:$E$2004,4,0))=TRUE,\"\",VLOOKUP(LEFT($C$6,8)&\".\"&$C51,Formandos!$B$3:$E$2004,4,0))","v":""},null,null,null,null,null,null,"",""]
[null,"n",40,{"$f":"IF(ISERROR(VLOOKUP(LEFT($C$6,8)&\".\"&$C52,Formandos!$B$3:$E$2004,4,0))=TRUE,\"\",VLOOKUP(LEFT($C$6,8)&\".\"&$C52,Formandos!$B$3:$E$2004,4,0))","v":""},null,null,null,null,null,null,"",""]
[null,"s",41,{"$f":"IF(ISERROR(VLOOKUP(LEFT($C$6,8)&\".\"&$C53,Formandos!$B$3:$E$2004,4,0))=TRUE,\"\",VLOOKUP(LEFT($C$6,8)&\".\"&$C53,Formandos!$B$3:$E$2004,4,0))","v":""},null,null,null,null,null,null,"",""]
[null,"n",42,{"$f":"IF(ISERROR(VLOOKUP(LEFT($C$6,8)&\".\"&$C54,Formandos!$B$3:$E$2004,4,0))=TRUE,\"\",VLOOKUP(LEFT($C$6,8)&\".\"&$C54,Formandos!$B$3:$E$2004,4,0))","v":""},null,null,null,null,null,null,"",""]
[null,"s",43,{"$f":"IF(ISERROR(VLOOKUP(LEFT($C$6,8)&\".\"&$C55,Formandos!$B$3:$E$2004,4,0))=TRUE,\"\",VLOOKUP(LEFT($C$6,8)&\".\"&$C55,Formandos!$B$3:$E$2004,4,0))","v":""},null,null,null,null,null,null,"",""]
[null,"n",44,{"$f":"IF(ISERROR(VLOOKUP(LEFT($C$6,8)&\".\"&$C56,Formandos!$B$3:$E$2004,4,0))=TRUE,\"\",VLOOKUP(LEFT($C$6,8)&\".\"&$C56,Formandos!$B$3:$E$2004,4,0))","v":""},null,null,null,null,null,null,"",""]
[null,"s",45,{"$f":"IF(ISERROR(VLOOKUP(LEFT($C$6,8)&\".\"&$C57,Formandos!$B$3:$E$2004,4,0))=TRUE,\"\",VLOOKUP(LEFT($C$6,8)&\".\"&$C57,Formandos!$B$3:$E$2004,4,0))","v":""},null,null,null,null,null,null,"",""]
[null,"n",46,{"$f":"IF(ISERROR(VLOOKUP(LEFT($C$6,8)&\".\"&$C58,Formandos!$B$3:$E$2004,4,0))=TRUE,\"\",VLOOKUP(LEFT($C$6,8)&\".\"&$C58,Formandos!$B$3:$E$2004,4,0))","v":""},null,null,null,null,null,null,"",""]
[null,"s",47,{"$f":"IF(ISERROR(VLOOKUP(LEFT($C$6,8)&\".\"&$C59,Formandos!$B$3:$E$2004,4,0))=TRUE,\"\",VLOOKUP(LEFT($C$6,8)&\".\"&$C59,Formandos!$B$3:$E$2004,4,0))","v":""},null,null,null,null,null,null,"",""]
[null,"n",48,{"$f":"IF(ISERROR(VLOOKUP(LEFT($C$6,8)&\".\"&$C60,Formandos!$B$3:$E$2004,4,0))=TRUE,\"\",VLOOKUP(LEFT($C$6,8)&\".\"&$C60,Formandos!$B$3:$E$2004,4,0))","v":""},null,null,null,null,null,null,"",""]
{"$rows_left_out":103}
{"sheet":"PLANO","index":1,"n_rows":65,"n_cols":4,"rows_kept":65,"cut":false,"hidden":true,"merged":[]}
[]
[]
[null,null,"MOD","HP"]
[null,"01A.2022 - Entretecendo o Conhecimento: História, Física e Química e Literatura","Curso",25]
[null,"02A.2022 - Capacitação Digital de Docentes – Nível 1","Oficina",25]
[null,"02B.2022 - Capacitação Digital de Docentes – Nível 1","Oficina",25]
[null,"04A.2022 - Capacitação Digital de Docentes – Nível 1","Oficina",25]
[null,"04B.2022 - Capacitação Digital de Docentes – Nível 1","Oficina",25]
[null,"04C.2022 - Capacitação Digital de Docentes – Nível 1","Oficina",25]
[null,"05A.2022 - Capacitação Digital de Docentes – Nível 2","Oficina",25]
[null,"05B.2022 - Capacitação Digital de Docentes – Nível 2","Oficina",25]
[null,"06B.2022 - Capacitação Digital de Docentes – Nível 2","Oficina",25]
[null,"07A.2022 - Capacitação Digital de Docentes – Nível 2","Oficina",25]
[null,"07B.2022 - Capacitação Digital de Docentes – Nível 2","Oficina",25]
[null,"10B.2022 - Capacitação Digital de Docentes – Nível 3","Oficina",25]
[null,"12A.2022 - Para uma Fundamentação e Melhoria das Práticas de Avaliação Pedagógica:\nProjetos de Intervenção nos Domínios do Ensino e da Avaliação","Oficina",25]
[null,"12B.2022 - Para uma Fundamentação e Melhoria das Práticas de Avaliação Pedagógica:\nProjetos de Intervenção nos Domínios do Ensino e da Avaliação","Oficina",25]
[null,"15B.2022 - II Jornadas da Primavera “Avaliar, Aprender, Transformar: Que (Des) Conexões?","Curso",15]
[null,"18A.2022 • Cidadania e Igualdade de Género","Curso",12]
[null,"28A.2022 • Cidadania e Desenvolvimento: o domínio dos Direitos Humanos na Escola","Curso",25]
[null,"31A.2022. • IV Encontro de Boas Práticas. Leitura e leitores: percursos","Curso",15]
[null,"36A.2022 • Capacitação Digital de docentes - Nível 1","Curso",25]
[null,"36B.2022 • Capacitação Digital de docentes - Nível 1","Curso",25]
[null,"37A.2022 • Capacitação Digital de docentes - Nível 2","Curso",25]
[null,"37B.2022 • Capacitação Digital de docentes - Nível 2","Curso",25]
[null,"37F.2022 • Capacitação Digital de docentes - Nível 2","Curso",25]
[null,"37G.2022 • Capacitação Digital de docentes - Nível 2","Curso",25]
[null,"37I.2022 • Capacitação Digital de docentes - Nível 2","Curso",25]
[null,"37J.2022 • Capacitação Digital de docentes - Nível 2","Curso",25]
[null,"39A.2022 • III Encontro de Música em Tibães","Curso",12.5]
[null,"40A.2022 • A Plataforma Hypatiamat para 2.º Ciclo do Ensino Básico","Oficina",25]
[null,"42A.2022 • I Congresso Guitarrístico de Braga","Curso",12.5]
[null,"44A.2022 • Cidadania e Desenvolvimento: o domínio dos Direitos Humanos na Escola","Curso",25]
[null,"45A.2022 • Bibliotecas escolares; aprendizagem, inovação e inclusão","Curso",25]
[null,"49A.2022 • Organização e Gestão de Bibliotecas Escolares - Missão e organização da Biblioteca Escolar (módulo 2)","Curso",25]
[null,"50A.2022 • Edição de Partituras – Sibelius software Nível 2","Curso",25]
[null,"01A.2023 • Aprendizagens essenciais de Matemática para o 1.º ciclo do Ensino Básico","Oficina",25]
[null,"02A.2023 • Aprendizagens essenciais de Matemática para o 2.º ciclo do Ensino Básico","Oficina",25]
[null,"03A.2023 • A presença em linha das bibliotecas escolares no contexto do desenvolvimento digital das escolas","Curso",30]
[null,"04A.2023 • Capacitação Digital de docentes - Nível 2","Oficina",25]
[null,"04B.2023 • Capacitação Digital de docentes - Nível 2","Oficina",25]
[null,"04C.2023 • Capacitação Digital de docentes - Nível 2","Oficina",25]
[null,"04D.2023 • Capacitação Digital de docentes - Nível 2","Oficina",25]
[null,"04E.2023 • Capacitação Digital de docentes - Nível 2","Oficina",25]
[null,"04F.2023 • Capacitação Digital de docentes - Nível 2","Oficina",25]
[null,"05A.2023 • Capacitação Digital de docentes - Nível 1","Oficina",25]
[null,"06A.2023 • Criação de ambientes de aprendizagem inclusivos e inovadores","Oficina",25]
[null,"06B.2023 • Criação de ambientes de aprendizagem inclusivos e inovadores","Oficina",25]
[null,"07A.2023 • Práticas pedagógicas inclusivas em sala de aula","Curso",25]
[null,"07B.2023 • Práticas pedagógicas inclusivas em sala de aula","Curso",25]
[null,"07C.2023 • Práticas pedagógicas inclusivas em sala de aula","Curso",25]
[null,"07D.2023 • Práticas pedagógicas inclusivas em sala de aula","Curso",25]
[null,"08A.2023 • As lideranças na promoção de ambientes educativos inclusivos","Curso",25]
[null,"09A.2023 • Para a Melhoria das Práticas de Avaliação Pedagógica_desenvolvimento e concretização dos Projetos de intervenção","Circulo de Estudos",25]
[null,"10A.2023 • ","ACD"]
[null,"11A.2023 • Capacitação digital de docentes da educação pré-escolar","Oficina",25]
[null,"12A.2023 • Capacitação Digital de docentes - Nível 3","Oficina",25]
[null,"13A.2023 • Aprendizagens Essenciais de Matemática B e Profissional para o Ensino Secundário","Oficina",25]
[null,"14A.2023 • Mergulhar na Inteligência Artificial – utilização em sala de aula para potenciar a aprendizagem e competências dos alunos"]
[null,"15A.2023 • III Jornadas da Primavera | 'Perspetivas de Escola: visões caleidoscópicas'","Curso",15]
{"$rows_left_out":6}
{"sheet":"Formandos","index":2,"n_rows":2504,"n_cols":5,"rows_kept":2504,"cut":false,"hidden":true,"merged":[]}
[]
[null,"COD.PROC","TURMA","N.PAUTA","Formando"]
[null,{"$f":"IF(C3=\"\",\"\",C3&\".\"&D3)","v":"01A.2022.1"},"01A.2022",1,"Ana Cristina Almeida Brandão Pinto"]
[null,{"$f":"IF(C4=\"\",\"\",C4&\".\"&D4)","v":"01A.2022.2"},"01A.2022",2,"Ana Paula Silva Rodrigues"]
[null,"01A.2022.3","01A.2022",3,"António José Afonso Lourenço"]
[null,"01A.2022.4","01A.2022",4,"Cláudia Maria Oliveira Pires"]
[null,"01A.2022.5","01A.2022",5,"Cristiana Nogueira Silva"]
[null,"01A.2022.6","01A.2022",6,"Diva Paula Bernardino"]
[null,"01A.2022.7","01A.2022",7,"Elisa Nazaré Rodrigues Carvalho"]
[null,"01A.2022.8","01A.2022",8,"Fernanda Manuela Barros Marques"]
[null,"01A.2022.9","01A.2022",9,"Hélder Maximino Couto Barbosa"]
[null,"01A.2022.10","01A.2022",10,"Helena Maria Domingues"]
[null,"01A.2022.11","01A.2022",11,"Jenny Magalhães Cunha"]
[null,"01A.2022.12","01A.2022",12,"Jorge Manuel Miranda Mourão Peixoto"]
[null,"01A.2022.13","01A.2022",13,"Júlia Maria Bastos Silva"]
[null,"01A.2022.14","01A.2022",14,"Lara Sofia Moreira Silva Alves"]
[null,"01A.2022.15","01A.2022",15,"Margarida Maria Gonçalves Ribeiro Figueiredo Baptista"]
[null,"01A.2022.16","01A.2022",16,"Maria Alívio Cerqueira Ribeiro"]
[null,"01A.2022.17","01A.2022",17,"Maria Conceição Oliveira Lopes"]
[null,"01A.2022.18","01A.2022",18,"Maria Fátima Alves Araújo"]
[null,"01A.2022.19","01A.2022",19,"Maria Jacinta Páscoa Gomes"]
[null,"01A.2022.20","01A.2022",20,"Maria Leonor Rodrigues Lopes"]
[null,"01A.2022.21","01A.2022",21,"Maria Madalena Albergaria"]
[null,"01A.2022.22","01A.2022",22,"Maria Teresa Cerqueira Pereira"]
[null,"01A.2022.23","01A.2022",23,"Teresa Alexandra Faria Vasconcelos Guedes Machado"]
[null,{"$f":"IF(C26=\"\",\"\",C26&\".\"&D26)","v":"02A.2022.1"},"02A.2022",1,"\tAna Paula Castro Fernandes"]
[null,"02A.2022.2","02A.2022",2,"Amadeu Sá Simões"]
[null,"02A.2022.3","02A.2022",3,"Ana Filipa Antunes Silva"]
[null,"02A.2022.4","02A.2022",4,"Ana Maria Cerqueira Araújo"]
[null,"02A.2022.5","02A.2022",5,"Anabela Conceição Gomes Ferreira Dias"]
[null,"02A.2022.6","02A.2022",6,"António Joaquim Matias Bento"]
[null,"02A.2022.7","02A.2022",7,"Cristina Isabel Teixeira Marques"]
[null,"02A.2022.8","02A.2022",8,"Esmeralda Maria Couto Silva Graça"]
[null,"02A.2022.9","02A.2022",9,"João Loureiro Beleza"]
[null,"02A.2022.10","02A.2022",10,"Luísa Conceição Ferreira Andrade"]
[null,"02A.2022.11","02A.2022",11,"Maria Adelaide Fernandes Veiga Pereira Sousa"]
[null,"02A.2022.12","02A.2022",12,"Maria Conceição Araújo Ferreira Silva Costa"]
[null,"02A.2022.13","02A.2022",13,"Maria Conceição Luís Silva Gonçalves"]
[null,"02A.2022.14","02A.2022",14,"Maria Sameiro Cunha Magalhães"]
[null,"02A.2022.15","02A.2022",15,"Vítor Manuel Figueiredo Castanheira Martins"]
[null,"02B.2022.1","02B.2022",1,"Ana Mafalda Conde Rocha"]
[null,"02B.2022.2","02B.2022",2,"Ana Maria Moreira Fernandes"]
[null,"02B.2022.3","02B.2022",3,"Branca Cristina Pina Lourenço"]
[null,"02B.2022.4","02B.2022",4,"Carla Maria Torres Sousa"]
[null,"02B.2022.5","02B.2022",5,"Carlos Frederico Brás Pinto"]
[null,"02B.2022.6","02B.2022",6,"Cristina Maria Vieira Gonçalves"]
[null,"02B.2022.7","02B.2022",7,"Helena Maria Cruz Marques Figueiredo"]
[null,"02B.2022.8","02B.2022",8,"Lígia Maria Basto Lima Silva Antunes"]
[null,"02B.2022.9","02B.2022",9,"Margarida Rajão Machado"]
[null,"02B.2022.10","02B.2022",10,"Maria Antonieta Ferreira Freitas"]
[null,"02B.2022.11","02B.2022",11,"Maria Conceição Fernandes Esteves"]
[null,"02B.2022.12","02B.2022",12,"Maria Fátima Garrido Costa"]
[null,"02B.2022.13","02B.2022",13,"Maria Helena Faria Mendonça Figueiredo"]
[null,"02B.2022.14","02B.2022",14,"Maria Helena Pires Gonçalves Pereira"]
[null,"02B.2022.15","02B.2022",15,"Maria Lúcia Magalhães Couto Silva"]
[null,"02B.2022.16","02B.2022",16,"Maria Teresa Pereira Sousa"]
[null,"02B.2022.17","02B.2022",17,"Olímpia Jesus Pereira Santos"]
[null,"02B.2022.18","02B.2022",18,"Virgínia Maria Correia Santos Monteiro Dias"]
[null,"04A.2022.1","04A.2022",1,"Ana Paula Ferreira Braga Silva"]
[null,"04A.2022.2","04A.2022",2,"Célia Brízida Bárbara Conde"]
{"$rows_left_out":2444}